Jump to content


  • Content Count

  • Joined

  • Last visited

  1. I agree with Bas, recently integrated a model to UVM driver/component using standard TLM socket (simple_initiator_socket), tried with TLM put port first but didn't work. -RC
  2. Thanks Stephan, your comments were helpful. Examples work with the default version though i still need to figure out why it didn't work for gcc 4.1.2, LD_LIBRARY_PATH is correct for gcc but not sure about binutils PATH, will debug it further but at least i know that the problem is in setup, not the tar/code (which was anyways less likely).
  3. hi All, I am trying to compile UVM-SC in linux (gcc version 4.1.2, SUSE Linux Enterprise Desktop 11 SP4) but it fails at 'gmake check' with the below error: ---------------------------------------------------------------------- sc_main.cpp:(.text._ZN3top11build_phaseERN3uvm9uvm_phaseE[top::build_phase(uvm::uvm_phase&)]+0x29): undefined reference to `std::basic_ostream<char, std::char_traits<char> >& std::__ostream_insert<char, std::char_traits<char> >(std::basic_ostream<char, std::char_traits<char> >&, char const*, long)' ../../src/uvmsc/.libs/libuvm-systemc.so: undefined reference to `std::basic_ostream<char, std::char_traits<char> >& std::basic_ostream<char, std::char_traits<char> >::_M_insert<void const*>(void const*)' ../../src/uvmsc/.libs/libuvm-systemc.so: undefined reference to `std::basic_ostream<char, std::char_traits<char> >& std::basic_ostream<char, std::char_traits<char> >::_M_insert<double>(double)' ../../src/uvmsc/.libs/libuvm-systemc.so: undefined reference to `std::basic_ostream<char, std::char_traits<char> >& std::basic_ostream<char, std::char_traits<char> >::_M_insert<unsigned long>(unsigned long)' collect2: ld returned 1 exit status gmake[3]: *** [simple/callbacks/basic/test] Error 1 gmake[3]: Leaving directory `/SystemC/UVMC/uvm-systemc-1.0-beta2/objdir/examples/uvmsc' gmake[2]: *** [check-am] Error 2 gmake[2]: Leaving directory `/SystemC/UVMC/uvm-systemc-1.0-beta2/objdir/examples/uvmsc' gmake[1]: *** [check-recursive] Error 1 gmake[1]: Leaving directory `/SystemC/UVMC/uvm-systemc-1.0-beta2/objdir/examples' gmake: *** [check-recursive] Error 1 ---------------------------------------------------------------------- Any idea what could be missing here? similar undefined messages are present in log befoe the collect2 ld error as well, not sure which symbols are missing. Thanks RC
  4. Thanks Bas, response to questions is posted below: Which interfaces does the DUT have? Multiple interfaces with standard AMBA and a couple of others (non-standardized) What is the complexity of the DUT? Relatively complex, most of the operations are predefined and have a standard task to be performed Do you need a register model? yes Does the DUT contain mixed signal functionality? no What kind of test scenarios do you envision? Directed / constrained-random? both Do you build the testbench from scratch or are you reusing verification components / tests? - from scratch Do you plan to reuse the tests and/or testbench in other environments, like HDL simulations or in a validation/lab environment? SystemC model yes, testbench yes (as much as possible)
  5. hi All, Can you please suggest the recommended way to create a SystemC testbench for SystemC model verification? I looked at UVM SystemC as well, considering that its relatively new, do you suggest using it for a project? The similarity to UVM makes it easier to adopt. thanks, RC
  6. Nice Attempt, but UVM Connect needs to be updated to support more recent version of gcc
  • Create New...